{"text_format":"1","workbook":"xlsx","n_sheets":5,"sheets":["TD SUMMARY for pivot","Index","PT","PC","SUMMARY for pivot"],"not_rendered":{"charts":1,"images":0,"macros":1,"external_links":0,"defined_names":2,"comments":2,"pivot_tables":1},"unopened":[],"bounds":{"document_bytes":16777216,"sheet_cells":100000,"rows_first":2000,"rows_last":500,"rows_between":2000,"halvings":0,"cell_chars":16384,"cell_head_chars":4096},"cells_cut":0,"cells_raw":0,"read":"whole","date_system":"1900"}

{"sheet":"TD SUMMARY for pivot","index":0,"n_rows":871,"n_cols":21,"rows_kept":871,"cut":false,"hidden":true,"merged":[]}
["Site","Name","Year","Uniform Rate of Progress-20% Worst Days","Haze Index - 20% Worst Days","Haze Index-5-year-20% Worst Days","Haze Index - 20% Clearest Days","Haze Index-5-year-20% Clearest Days","No Degradation-20% Clearest Days","Haze Index - 20% Most Impaired Days","Haze Index-5-year-20% Most Impaired Days","Uniform Rate of Progress-20% Most Impaired Days","URP worst rate","URP IMP rate","20% Worst NAT","20% Most Impaired NAT","Straight line path to RPG - 20% Clearest Days","Straight line path to RPG - 20% Most Impaired Days","Straight line path to RPG - 20% Worst Days","Reasonable Progress Goal - 20% Most Impaired","Reasonable Progress Goal - 20% Worst"]
["ACAD","Acadia National Park, ME",2000,null,21.636684285714288,null,8.9009695000000022,null,null,20.7527680952381,null,null,0.17430767545238099,0.19377900780079357,12.43373718,10.387492461000001]
["ACAD","Acadia National Park, ME",2001,null,23.278675199999999,null,8.8742708333333322,null,null,22.374298400000001]
["ACAD","Acadia National Park, ME",2002,null,23.913307999999997,null,8.7700729166666651,null,null,22.909756799999997]
["ACAD","Acadia National Park, ME",2003,null,23.648186249999995,null,8.7697208333333361,null,null,22.696693749999998]
["ACAD","Acadia National Park, ME",2004,22.892197707142859,21.984134800000003,22.892197707142859,8.5627970833333347,8.7755662333333344,8.7755662333333344,21.3376476,22.014232929047616,22.014232929047616,null,null,null,null,8.7755658964445011,22.014233122314003,22.892197970045952]
["ACAD","Acadia National Park, ME",2005,22.717890031690477,23.011447083333334,23.167150266666667,7.5775834782608689,8.5108890289855079,8.7755662333333344,21.720298749999998,22.207739059999998,21.820453921246823,null,null,null,null,8.6736673174259806,21.653223408884251,22.558356387960703]
["ACAD","Acadia National Park, ME",2006,22.543582356238094,23.374681666666671,23.186351560000002,8.1728882608695645,8.3706125144927537,8.7755662333333344,22.687711666666669,22.270421713333331,21.626674913446031,null,null,null,null,8.5717687384074601,21.2922136954545,22.224514805875454]
["ACAD","Acadia National Park, ME",2007,22.369274680785711,21.744895833333334,22.752669126666667,8.2072904347826068,8.2580560181159424,8.7755662333333344,20.835774999999998,21.85562535333333,21.432895905645239,null,null,null,null,8.4698701593889396,20.931203982024748,21.890673223790206]
["ACAD","Acadia National Park, ME",2008,22.194967005333329,20.205031200000001,22.064038116666666,7.7634958333333328,8.0568110181159405,8.7755662333333344,19.349384000000001,21.186163403333332,21.239116897844447,null,null,null,null,8.3679715803704191,20.570194268594996,21.556831641704957]
["ACAD","Acadia National Park, ME",2009,22.020659329880946,18.933996800000003,21.454010516666667,6.9209791666666662,7.7284474347826073,8.7755662333333344,18.168552800000001,20.552344443333332,21.045337890043655,null,null,null,null,8.2660730013518986,20.209184555165244,21.222990059619708]
["ACAD","Acadia National Park, ME",2010,21.846351654428563,18.266066250000005,20.504934350000003,6.706666666666667,7.5542640724637664,8.7755662333333344,17.519251666666673,19.712135026666669,20.851558882242863,null,null,null,null,8.1641744223333781,19.848174841735492,20.889148477534459]
["ACAD","Acadia National Park, ME",2011,21.672043978976181,19.04777125,19.639552266666669,7.4505560869565226,7.4097976376811587,8.7755662333333344,17.307181249999996,18.636028943333336,20.65777987444207,null,null,null,null,8.0622758433148576,19.48716512830574,20.55530689544921]
["ACAD","Acadia National Park, ME",2012,21.497736303523798,16.844777826086954,18.65952866521739,7.7739665217391307,7.3231328550724637,8.7755662333333344,15.915803913043478,17.65203472594203,20.464000866641278,null,null,null,null,7.9603772642963371,19.126155414875988,20.221465313363961]
["ACAD","Acadia National Park, ME",2013,21.323428628071415,16.540706666666669,17.926663758550724,6.2538669565217395,7.0212070797101447,8.7755662333333344,15.312182083333331,16.844594342608694,20.270221858840486,null,null,null,null,7.8584786852778166,18.765145701446237,19.887623731278712]
["ACAD","Acadia National Park, ME",2014,21.149120952619032,16.675467083333334,17.47495781521739,7.032901739130434,7.0435915942028995,8.7755662333333344,15.364677916666665,16.28381936594203,20.076442851039694,null,null,null,null,7.7565801062592961,18.404135988016485,19.553782149193463]
["ACAD","Acadia National Park, ME",2015,20.97481327716665,17.791447916666666,17.380034148550724,6.0495565217391309,6.9121695652173916,8.7755662333333344,16.072577499999998,15.994484532608695,19.882663843238902,null,null,null,null,7.6546815272407756,18.043126274586733,19.219940567108214]
["ACAD","Acadia National Park, ME",2016,20.800505601714267,14.632227500000001,16.496925398550722,6.0845679166666677,6.6389719311594204,8.7755662333333344,13.723970833333334,15.277842449275363,19.68888483543811,null,null,null,null,7.552782948222255,17.682116561156981,18.886098985022965]
["ACAD","Acadia National Park, ME",2017,20.626197926261884,15.925016249999999,16.312973083333333,7.18248695652174,6.5206760181159424,8.7755662333333344,13.966052916666669,14.887892249999998,19.495105827637317,null,null,null,null,7.4508843692037345,17.321106847727229,18.552257402937716]
["ACAD","Acadia National Park, ME",2018,20.451890250809502,14.639886521739127,15.932809054347825,6.5350154545454533,6.5769057177206847,8.7755662333333344,13.576716956521736,14.540799224637681,19.301326819836525,null,null,null,null,7.348985790185214,16.960097134297477,18.218415820852467]
{"$rows_left_out":852}
{"sheet":"Index","index":1,"n_rows":22,"n_cols":8,"rows_kept":22,"cut":false,"hidden":false,"merged":[]}
[]
[]
[]
[]
[]
[]
[]
[]
[]
[]
[]
[]
[]
[]
[]
[]
[]
[]
[]
[]
{"$rows_left_out":3}
{"sheet":"PT","index":2,"n_rows":37,"n_cols":13,"rows_kept":37,"cut":false,"hidden":false,"merged":[]}
["Index"]
["Site","ACAD",{"$f":"VLOOKUP(B2,'SUMMARY for pivot'!$A$2:$B$843,2,FALSE)","v":"Acadia National Park, ME"}]
[]
["Row Labels","Uniform Rate of Progress- 20% Worst Days","Haze Index- 20% Worst Days","Haze Index (5-yr avg)- 20% Worst Days"," Straight line path to RPG - 20% Worst Days","Haze Index- 20% Best Days","Haze Index (5-yr avg)- 20% Best Days","No Degradation- 20% Best Days"," Straight line path to RPG - 20% Best Days","Uniform Rate of Progress- 20% Most Impaired Days","Haze Index- 20% Most Impaired Days","Haze Index (5-yr avg)- 20% Most Impaired Days"," Straight line path to RPG - 20% Most Impaired Days"]
[2000,null,21.636684285714288,{"$error":"#DIV/0!"},null,8.9009695000000022,null,null,null,null,20.7527680952381]
[2001,null,23.278675199999999,null,null,8.8742708333333322,null,null,null,null,22.374298400000001]
[2002,null,23.913307999999997,null,null,8.7700729166666651,null,null,null,null,22.909756799999997]
[2003,null,23.648186249999995,null,null,8.7697208333333361,null,null,null,null,22.696693749999998]
[2004,22.892197707142856,21.984134799999996,22.892197707142856,22.892197970045952,8.5627970833333347,8.7755662333333344,8.7755662333333344,8.7755658964445011,22.014232929047616,21.3376476,22.014232929047616,22.014233122314003]
[2005,22.717890031657141,23.089874800000004,23.182835809999997,22.558356387960703,7.6561283333333341,8.5265980000000017,8.7755662333333344,8.6736673174259806,21.820451396563488,21.850372400000001,22.233753789999998,21.653223408884251]
[2006,22.543582356171427,23.374681666666671,23.202037103333332,22.224514805875454,8.2539025000000006,8.4025243333333357,8.7755662333333344,8.5717687384074601,21.626669864079361,22.687711666666669,22.296436443333331,21.2922136954545]
[2007,22.369274680685713,21.744895833333334,22.768354670000001,21.890673223790206,8.2758608333333346,8.3036819166666671,8.7755662333333344,8.4698701593889396,21.432888331595233,20.835775000000002,21.881640083333334,20.931203982024748]
[2008,22.194967005199999,20.205031200000001,22.079723660000003,21.556831641704957,7.7634958333333337,8.102436916666667,8.7755662333333344,8.3679715803704191,21.239106799111106,19.349384000000001,21.212178133333332,20.570194268594996]
[2009,22.020659329714285,18.933996799999999,21.469696060000004,21.222990059619708,6.9209791666666662,7.7740733333333338,8.7755662333333344,8.2660730013518986,21.045325266626978,18.168552800000001,20.578359173333332,20.209184555165244]
[2010,21.84635165422857,18.266066249999998,20.504934349999999,20.889148477534459,6.706666666666667,7.5841810000000009,8.7755662333333344,8.1641744223333781,20.851543734142851,17.519251666666669,19.712135026666669,19.848174841735492]
[2011,21.672043978742856,19.011153199999995,19.632228656666666,20.55530689544921,7.5093412500000012,7.4352687500000005,8.7755662333333344,8.0622758433148576,20.657762201658723,17.387662800000001,18.652125253333335,19.48716512830574]
[2012,21.497736303257142,16.671213599999998,18.617492209999998,20.221465313363961,7.7525445833333331,7.3306054999999999,8.7755662333333344,7.9603772642963371,20.463980669174596,15.809913999999999,17.646953053333334,19.126155414875988]
[2013,21.323428627771428,16.540706666666665,17.884627303333332,19.887623731278712,6.2538669565217395,7.0286797246376809,8.7755662333333344,7.8584786852778166,20.270199136690469,15.312182083333335,16.839512670000001,18.765145701446237]
[2014,21.149120952285713,16.675467083333331,17.432921359999998,19.553782149193463,7.032901739130434,7.0510642391304348,8.7755662333333344,7.7565801062592961,20.076417604206341,15.364677916666665,16.278737693333333,18.404135988016485]
[2015,20.974813276799999,17.791447916666662,17.337997693333328,19.219940567108214,6.0495565217391309,6.9196422101449286,8.7755662333333344,7.6546815272407756,19.882636071722214,16.072577500000005,15.989402860000002,18.043126274586733]
{"$rows_left_out":18}
{"sheet":"PC","index":3,"n_rows":1,"n_cols":1,"rows_kept":1,"cut":false,"hidden":false,"merged":[]}
["Index"]

{"sheet":"SUMMARY for pivot","index":4,"n_rows":872,"n_cols":31,"rows_kept":872,"cut":false,"hidden":false,"merged":[]}
["Index"]
["Site","Name","Year","Uniform Rate of Progress-20% Worst Days","Haze Index - 20% Worst Days","Haze Index-5-year-20% Worst Days","Haze Index - 20% Best Days","Haze Index-5-year-20% Best Days","No Degradation-20% Best Days","Haze Index - 20% Most Impaired Days","Haze Index-5-year-20% Most Impaired Days","Uniform Rate of Progress-20% Most Impaired Days","URP worst rate","URP IMP rate","20% Worst NAT","20% Most Impaired NAT","Straight line path to RPG - 20% Best Days","Straight line path to RPG - 20% Most Impaired Days","Straight line path to RPG - 20% Worst Days","Reasonable Progress Goal - 20% Most Impaired","Reasonable Progress Goal - 20% Worst",null,null,null,null,null,null,"nc2_12_2019_2p",null,null,"endpoint 2064 DEC 2019"]
["ACAD","Acadia National Park, ME",2000,null,21.636684285714288,{"$f":"IF(COUNT(#REF!)<3,\"\",AVERAGE(#REF!))","v":""},8.9009695000000022,null,null,20.7527680952381,null,null,{"$f":"(F7-O3)/60","v":0.17430767548571427},{"$f":"(K7-P3)/60","v":0.19378153248412694},{"$f":"AC4","v":12.433737177999999},{"$f":"AE4","v":10.387340979999999},null,null,null,null,null,null,null,null,null,null,null,"NAT 10","NAT 90","1st year","NAT 90 IMP"]
["ACAD","Acadia National Park, ME",2001,null,23.278675199999999,null,8.8742708333333322,null,null,22.374298400000001,null,null,null,null,null,null,null,null,null,null,null,null,null,null,null,null,"ACAD1",4.6603568027,12.433737177999999,null,10.387340979999999]
["ACAD","Acadia National Park, ME",2002,null,23.913307999999997,null,8.7700729166666651,null,null,22.909756799999997,null,null,null,null,null,null,null,null,null,null,null,null,null,null,null,null,"BRIG1",5.5172266928999996,12.245637987,null,10.681987469999999]
["ACAD","Acadia National Park, ME",2003,null,23.648186249999995,null,8.7697208333333361,null,null,22.696693749999998,null,null,null,null,null,null,null,null,null,null,null,null,null,null,null,null,"DOSO1",3.6371528972,10.393592031000001,null,8.9167605810000001]
["ACAD","Acadia National Park, ME",2004,{"$f":"IF(F7=\"\",\"\",F7)","v":22.892197707142856},21.984134799999996,{"$f":"IF(COUNT(E3:E7)<3,\"\",AVERAGE(E3:E7))","v":22.892197707142856},8.5627970833333347,{"$f":"IF(COUNT(G3:G7)<3,\"\",AVERAGE(G3:G7))","v":8.7755662333333344},{"$f":"IF(H7=\"\",\"\",H7)","v":8.7755662333333344},21.3376476,{"$f":"IF(COUNT(J3:J7)<3,\"\",AVERAGE(J3:J7))","v":22.014232929047616},{"$f":"IF(K7=\"\",\"\",K7)","v":22.014232929047616},null,null,null,null,8.7755658964445011,22.014233122314003,22.892197970045952,null,null,null,null,null,null,null,"GRGU1",3.7306103697999999,11.993656168999999,null,9.7754815340000007]
["ACAD","Acadia National Park, ME",2005,{"$f":"IF(D7=\"\",\"\",D7-M3)","v":22.717890031657141},23.089874800000004,{"$f":"IF(COUNT(E4:E8)<3,\"\",AVERAGE(E4:E8))","v":23.182835809999997},7.6561283333333341,{"$f":"IF(COUNT(G4:G8)<3,\"\",AVERAGE(G4:G8))","v":8.5265980000000017},{"$f":"I7","v":8.7755662333333344},21.850372400000001,{"$f":"IF(COUNT(J4:J8)<3,\"\",AVERAGE(J4:J8))","v":22.233753789999998},{"$f":"IF(L7=\"\",\"\",L7-N3)","v":21.820451396563488},null,null,null,null,8.6736673174259806,21.653223408884251,22.558356387960703,null,null,null,null,null,null,null,"JARI1",4.3893142560999996,11.128561271000001,null,9.4668398269999994]
["ACAD","Acadia National Park, ME",2006,{"$f":"IF(D8=\"\",\"\",D8-M3)","v":22.543582356171427},23.374681666666671,23.202037103333332,8.2539025000000006,8.4025243333333357,{"$f":"I8","v":8.7755662333333344},22.687711666666669,22.296436443333331,{"$f":"IF(L8=\"\",\"\",L8-N3)","v":21.626669864079361},null,null,null,null,8.5717687384074601,21.2922136954545,22.224514805875454,null,null,null,null,null,null,null,"LYEB1",2.9585683619999998,10.263961604,2012,8.5028252519999992]
["ACAD","Acadia National Park, ME",2007,{"$f":"IF(D9=\"\",\"\",D9-M3)","v":22.369274680685713},21.744895833333334,22.768354670000001,8.2758608333333346,8.3036819166666671,8.7755662333333344,20.835775000000002,21.881640083333334,{"$f":"IF(L9=\"\",\"\",L9-N3)","v":21.432888331595233},null,null,null,null,8.4698701593889396,20.931203982024748,21.890673223790206,null,null,null,null,null,null,null,"LYBR_RHTS",2.7944661922999998,11.734856288,null,10.243066239999999]
["ACAD","Acadia National Park, ME",2008,{"$f":"IF(D10=\"\",\"\",D10-M3)","v":22.194967005199999},20.205031200000001,22.079723660000003,7.7634958333333337,8.102436916666667,8.7755662333333344,19.349384000000001,21.212178133333332,{"$f":"IF(L10=\"\",\"\",L10-N3)","v":21.239106799111106},null,null,null,null,8.3679715803704191,20.570194268594996,21.556831641704957,null,null,null,null,null,null,null,"LYBR1",2.7944661922999998,11.734856288,null,10.566155589999999]
["ACAD","Acadia National Park, ME",2009,{"$f":"IF(D11=\"\",\"\",D11-M3)","v":22.020659329714285},18.933996799999999,21.469696060000004,6.9209791666666662,7.7740733333333338,8.7755662333333344,18.168552800000001,20.578359173333332,{"$f":"IF(L11=\"\",\"\",L11-N3)","v":21.045325266626978},null,null,null,null,8.2660730013518986,20.209184555165244,21.222990059619708,null,null,null,null,null,null,null,"MOOS1",5.0179607756999998,12.009617625000001,null,9.9760873409999995]
["ACAD","Acadia National Park, ME",2010,{"$f":"IF(D12=\"\",\"\",D12-M3)","v":21.84635165422857},18.266066249999998,20.504934349999999,6.706666666666667,7.5841810000000009,8.7755662333333344,17.519251666666669,19.712135026666669,{"$f":"IF(L12=\"\",\"\",L12-N3)","v":20.851543734142851},null,null,null,null,8.1641744223333781,19.848174841735492,20.889148477534459,null,null,null,null,null,null,null,"SHEN1",3.1463273572000001,11.354505846,null,9.5204195729999999]
["ACAD","Acadia National Park, ME",2011,{"$f":"IF(D13=\"\",\"\",D13-M3)","v":21.672043978742856},19.011153199999995,19.632228656666666,7.5093412500000012,7.4352687500000005,8.7755662333333344,17.387662800000001,18.652125253333335,{"$f":"IF(L13=\"\",\"\",L13-N3)","v":20.657762201658723},null,null,null,null,8.0622758433148576,19.48716512830574,20.55530689544921,null,null,null,null,null,null,null,"ADPI1",4.1197038881000001,11.567640618,null,10.481110960000001]
["ACAD","Acadia National Park, ME",2012,{"$f":"IF(D14=\"\",\"\",D14-M3)","v":21.497736303257142},16.671213599999998,18.617492209999998,7.7525445833333331,7.3306054999999999,8.7755662333333344,15.809913999999999,17.646953053333334,{"$f":"IF(L14=\"\",\"\",L14-N3)","v":20.463980669174596},null,null,null,null,7.9603772642963371,19.126155414875988,20.221465313363961,null,null,null,null,null,null,null,"AREN1",4.2382252395000002,11.766526169,null,10.170877689999999]
["ACAD","Acadia National Park, ME",2013,{"$f":"IF(D15=\"\",\"\",D15-M3)","v":21.323428627771428},16.540706666666665,17.884627303333332,6.2538669565217395,7.0286797246376809,8.7755662333333344,15.312182083333335,16.839512670000001,{"$f":"IF(L15=\"\",\"\",L15-N3)","v":20.270199136690469},null,null,null,null,7.8584786852778166,18.765145701446237,19.887623731278712,null,null,null,null,null,null,null,"BALT1"]
["ACAD","Acadia National Park, ME",2014,{"$f":"IF(D16=\"\",\"\",D16-M3)","v":21.149120952285713},16.675467083333331,17.432921359999998,7.032901739130434,7.0510642391304348,8.7755662333333344,15.364677916666665,16.278737693333333,{"$f":"IF(L16=\"\",\"\",L16-N3)","v":20.076417604206341},null,null,null,null,7.7565801062592961,18.404135988016485,19.553782149193463,null,null,null,null,null,null,null,"BRMA1",4.6458548309000003,12.06562151,null,10.464568959999999]
["ACAD","Acadia National Park, ME",2015,{"$f":"IF(D17=\"\",\"\",D17-M3)","v":20.974813276799999},17.791447916666662,17.337997693333328,6.0495565217391309,6.9196422101449286,8.7755662333333344,16.072577500000005,15.989402860000002,{"$f":"IF(L17=\"\",\"\",L17-N3)","v":19.882636071722214},null,null,null,null,7.6546815272407756,18.043126274586733,19.219940567108214,null,null,null,null,null,null,null,"CABA1",4.8276778345000002,12.832261338,null,10.933426219999999]
["ACAD","Acadia National Park, ME",2016,{"$f":"IF(D18=\"\",\"\",D18-M3)","v":20.800505601314285},14.632227499999999,16.46221255333333,6.0845679166666669,6.6346875434782602,8.7755662333333344,13.723970833333333,15.256664466666667,{"$f":"IF(L18=\"\",\"\",L18-N3)","v":19.688854539238086},null,null,null,null,7.552782948222255,17.682116561156981,18.886098985022965,null,null,null,null,null,null,null,"CACO1",5.9507735163,13.200409952999999,null,11.00077259]
["ACAD","Acadia National Park, ME",2017,{"$f":"IF(D19=\"\",\"\",D19-M3)","v":20.626197925828571},15.925016250000001,16.312973083333333,7.1824869565217382,6.5206760181159424,8.7755662333333344,13.966052916666664,14.887892249999998,{"$f":"IF(L19=\"\",\"\",L19-N3)","v":19.495073006753959},null,null,null,null,7.4508843692037345,17.321106847727229,18.552257402937716,null,null,null,null,null,null,null,"COHI1",4.3017381930000003,11.504921251000001]
{"$rows_left_out":852}